BDBM50131870 Butyl-phosphonothioic acid::CHEMBL331046
SMILES CCCCP(O)(O)=S
InChI Key InChIKey=DWNKWLFNYOZABF-UHFFFAOYSA-N
Data  2 KI
  Tab Delimited (TSV)   2D SDfile   Computed 3D by Vconf -m prep SDfile
Find this compound or compounds like it in BindingDB:
Activity Spreadsheet -- Enzyme Inhibition Constant Data from BindingDB
Found 1 hit for monomerid = 50131870
TargetSerine/threonine-protein phosphatase(Enterobacteria phage lambda)
Utah State University
Curated by ChEMBL
LigandPNGBDBM50131870(Butyl-phosphonothioic acid | CHEMBL331046)
Affinity DataKi:  2.00E+7nM. Assay description: Inhibitory activity against Serine/Threonine Protein Phosphatase (Lamda protein phosphatase)
In DepthDetails ArticlePubMed